{"text_format":"1","workbook":"xlsx","n_sheets":5,"sheets":["Saisie","Liste Produits éligibles NEW","Liste Pdts éligibles OLD","Défaut","Loc défaut"],"not_rendered":{"charts":0,"images":1,"macros":1,"external_links":0,"defined_names":3,"comments":1,"pivot_tables":0},"unopened":[],"bounds":{"document_bytes":16777216,"sheet_cells":100000,"rows_first":2000,"rows_last":500,"rows_between":2000,"halvings":0,"cell_chars":16384,"cell_head_chars":4096},"cells_cut":0,"cells_raw":0,"read":"whole","date_system":"1900"}

{"sheet":"Saisie","index":0,"n_rows":33,"n_cols":13,"rows_kept":33,"cut":false,"hidden":false,"merged":[[26,11,26,13],[25,3,25,5],[26,3,26,5],[20,9,20,11],[12,9,12,11],[13,9,13,11],[14,9,14,11],[15,9,15,11],[16,9,16,11],[20,12,20,13],[13,12,13,13],[14,12,14,13],[15,12,15,13],[12,12,12,13],[18,12,18,13],[19,3,19,5],[1,8,1,12],[24,11,24,13],[25,11,25,13],[11,3,11,5],[12,3,12,5],[13,3,13,5],[14,3,14,5],[15,3,15,5],[16,3,16,5],[17,3,17,5],[11,6,11,7],[12,6,12,7],[13,6,13,7],[14,6,14,7],[15,6,15,7],[18,3,18,5],[20,3,20,5],[19,6,19,7],[20,6,20,7],[18,6,18,7],[29,3,30,3],[22,3,22,5],[10,3,10,5],[10,6,10,7],[10,12,10,13],[11,12,11,13],[10,9,10,11],[11,9,11,11],[16,6,16,7],[17,6,17,7],[19,12,19,13],[17,9,17,11],[18,9,18,11],[19,9,19,11],[16,12,16,13],[17,12,17,13]]}
[]
[null,"RETOUR DE MATERIEL DEFECTUEUX",null,null,"1 -Je clique et un email se génère automatiquement ",null,null,null,"DANS LE CADRE DE LA GARANTIE"]
[null,"SAV EXPRESS",null,null,"en intégrant ma demande de SAV. ",null,null,null,null,"Vérifier au préalable la date de vente du/des produits engagés dans la demande (5 ans à date de vente)"]
[null,null,null,null,"2 - Puis sur l'émail je clique sur \"envoyer\" !"]
[]
[]
[null,"Nom GROSSISTE",null,null,"Date de la demande",null,null,"Tous les champs en jaune doivent être obligatoirement renseignés ",null,null,null,null,"Choisir parmi la liste proposée via le menu déroulant"]
[]
[null,null,"Choisir parmi la liste proposée via le menu déroulant"]
[]
[null,"Quant.","Référence","Désignation",null,null,"Nom de l'installateur/Client final",null,"Si Installateur, adresse mail","Type de défaut (obligatoire)",null,null,"Localisation défaut"]
[null,null,null,{"$f":"IFERROR(VLOOKUP(C12,'Liste Produits éligibles NEW'!A:B,2,FALSE),\"\")","v":""},null,null,null,null,null,"Fuite",null,null,"Flexibles ou tubes d'alimentation / Entrées"]
[null,null,null,{"$f":"IFERROR(VLOOKUP(C13,'Liste Produits éligibles NEW'!A:B,2,FALSE),\"\")","v":""}]
[null,null,null,{"$f":"IFERROR(VLOOKUP(C14,'Liste Produits éligibles NEW'!A:B,2,FALSE),\"\")","v":""}]
[null,null,null,{"$f":"IFERROR(VLOOKUP(C15,'Liste Produits éligibles NEW'!A:B,2,FALSE),\"\")","v":""}]
[null,null,null,{"$f":"IFERROR(VLOOKUP(C16,'Liste Produits éligibles NEW'!A:B,2,FALSE),\"\")","v":""}]
[null,null,null,{"$f":"IFERROR(VLOOKUP(C17,'Liste Produits éligibles NEW'!A:B,2,FALSE),\"\")","v":""}]
[null,null,null,{"$f":"IFERROR(VLOOKUP(C18,'Liste Produits éligibles NEW'!A:B,2,FALSE),\"\")","v":""}]
[null,null,null,{"$f":"IFERROR(VLOOKUP(C19,'Liste Produits éligibles NEW'!A:B,2,FALSE),\"\")","v":""}]
[null,null,null,{"$f":"IFERROR(VLOOKUP(C20,'Liste Produits éligibles NEW'!A:B,2,FALSE),\"\")","v":""}]
[null,null,null,{"$f":"IFERROR(VLOOKUP(C21,'Liste Produits éligibles NEW'!A:B,2,FALSE),\"\")","v":""}]
[]
[null,"OBLIGATOIRE : nom du commercial en charge du secteur :"]
[]
[null,null,null,null,null,null,null,null,null,null,null,"NOM ET ADRESSE DU GROSSISTE"]
[null,"Personne responsable du retour :     ","         NOM",null,null,null,null,null,null,null,null,"OBLIGATOIRE"]
[null,null,"          TEL."]
[]
[]
[null,"Mon numéro de dossier*",null,"FR-"]
[]
[]
[null,"*Ce numéro vous sera communiqué par retour de mail après votre demande, il commence par FR- suivi de 6 chiffres"]

{"sheet":"Liste Produits éligibles NEW","index":1,"n_rows":105,"n_cols":3,"rows_kept":105,"cut":false,"hidden":false,"merged":[]}
["REF","Desc","Gamme"]
[22054001,"Mitigeur Lavabo Taille S BauLoop 2020","BauLoop 2020"]
[23322001,"Mitigeur monocommande Lavabo Taille M Eurosmart Chromé","Eurosmart 2015"]
[23322003,"Mitigeur monocommande Lavabo Taille M Eurosmart Chromé","Eurosmart 2021"]
[23324001,"Mitigeur monocommande Lavabo Taille M Eurosmart Chromé","Eurosmart 2015"]
[23324003,"Mitigeur monocommande Lavabo Taille M Eurosmart Chromé","Eurosmart 2021"]
[23325000,"Mitigeur monocommande Lavabo Taille M Eurosmart Cosmopolitan Chromé","Eurosmart Cosmopolitan"]
[23327000,"Mitigeur monocommande Lavabo Taille M Eurosmart Cosmopolitan Chromé","Eurosmart Cosmopolitan"]
[23328000,"Mitigeur Lavabo Taille M"]
[23328001,"Mitigeur monocommande Lavabo Taille S Chromé BauEdge","BauEdge 2020"]
[23330000,"Mitigeur monocommande Lavabo Taille S BauEdge Chromé","BauEdge"]
[23330001,"Mitigeur monocommande Lavabo Taille S Chromé BauEdge","BauEdge 2020"]
[23331000,"Mitigeur Lavabo Taille S"]
[23333000,"Mitigeur Bidet"]
[23334000,"BauEdge mitigeur B/D mural​","BauEdge"]
[23335000,"Mitigeur monocommande Lavabo Taille S BauLoop Chromé","BauLoop"]
[23340000,"Mitigeur monocommande Douche BauLoop Chromé","BauLoop"]
[23341000,"Mitigeur monocommande Bain / Douche BauLoop Chromé","BauLoop"]
[23355000,"Start Loop mitigeur B/D mural​"]
[23356000,"Mitigeur monocommande Lavabo Taille S BauEdge Chromé","BauEdge"]
[23537002,"Mitigeur monocommande Lavabo Taille L Eurosmart Chromé","Eurosmart 2015"]
[23537003,"Mitigeur monocommande Lavabo Taille L Eurosmart Chromé","Eurosmart 2021"]
[23559000,"Mitigeur monocommande Lavabo Taille S BauEdge Chromé","BauEdge"]
[23559001,"Mitigeur monocommande Lavabo Taille S Chromé BauEdge","BauEdge 2020"]
[23560000,"Mitigeur monocommande Douche BauEdge Chromé","BauEdge"]
[23561000,"Mitigeur monocommande Bain / Douche BauEdge Chromé","BauEdge"]
[23562000,"Mitigeur monocommande Bain / Douche BauEdge Chromé","BauEdge"]
[23562001,"Mitigeur monocommande Bain / Douche Chromé BauEdge","BauEdge 2020"]
[23602001,"Mitigeur Bain / Douche BauLoop 2020","BauLoop 2020"]
[23633001,"Mitigeur Douche BauLoop 2020","BauLoop 2020"]
[23758001,"Mitigeur monocommande Lavabo Taille M Chromé BauEdge","BauEdge 2020"]
[23759000,"Mitigeur monocommande Lavabo Taille M BauEdge Chromé","BauEdge"]
[23759001,"Mitigeur monocommande Lavabo Taille M Chromé BauEdge","BauEdge 2020"]
[23760000,"Mitigeur Lavabo Taille M"]
[23762000,"Mitigeur monocommande Lavabo Taille M BauLoop Chromé","BauLoop"]
[23763000,"Mitigeur monocommande Lavabo Taille L BauLoop Chromé","BauLoop"]
[23763001,"Mitigeur Lavabo Taille L BauLoop 2020","BauLoop 2020"]
[23802000,"Mitigeur monocommande Lavabo Taille S BauEdge Chromé","BauEdge"]
[23822000,"Mitigeur monocommande Lavabo Taille M BauEdge Chromé","BauEdge"]
[23887001,"Mitigeur Lavabo Taille M BauLoop 2020","BauLoop 2020"]
[23913001,"Mitigeur monocommande Douche Chromé BauEdge","BauEdge 2020"]
[23914001,"Mitigeur monocommande Bain / Douche Chromé BauEdge","BauEdge 2020"]
[23921000,"Mitigeur monocommande Lavabo Taille XL Eurosmart Cosmopolitan Chromé","Eurosmart Cosmopolitan"]
[29078000,"BauEdge set mitigeur douche​","BauEdge"]
[30199000,"Mitigeur monocommande Evier Eurosmart Cosmopolitan Chromé","Eurosmart Cosmopolitan"]
[30355001,"Mitigeur Evier Eurosmart 2021","Eurosmart 2021"]
[31367000,"BauEdge mitigeur évier bec orientable​","BauEdge"]
[31367001,"BauEdge mitigeur évier bec orientable​","BauEdge"]
[31368001,"Mitigeur monocommande Evier BauLoop Chromé","BauLoop 2020"]
[31481001,"Mitigeur monocommande Evier Eurosmart Cosmopolitan Chromé","Eurosmart Cosmopolitan"]
[31590000,"Mitigeur monocommande Evier BauEdge Chromé","BauEdge 2020"]
[31682000,"Mitigeur monocommande Evier BauEdge Chromé","BauEdge 2020"]
[31693000,"BauEdge mitigeur évier bec med F​","BauEdge"]
[31694000,"Mitigeur monocommande Evier BauEdge Chromé","BauEdge 2020"]
[31706000,"Mitigeur monocommande Evier BauLoop Chromé","BauLoop 2020"]
[32158002,"Mitigeur monocommande Bain / Douche Eurosmart Chromé","Eurosmart 2015"]
[32158003,"Mitigeur monocommande Bain / Douche Eurosmart Chromé","Eurosmart 2021"]
[32172002,"Mitigeur monocommande Douche Eurosmart Chromé","Eurosmart 2015"]
[32172003,"Mitigeur monocommande Douche Eurosmart Chromé","Eurosmart 2021"]
[32221003,"Eurosmart 2021 mitigeur évier bec bas F","Eurosmart 2021"]
[32223003,"Eurosmart 2021 mitigeur évier C bec haut F","Eurosmart 2021"]
[32224003,"Eurosmart 2021 mitigeur évier mural bec bas","Eurosmart 2021"]
[32819000,"BauEdge mitigeur lavabo​","BauEdge"]
[32822000,"Mitigeur 1/2 Lavabo"]
[32823000,"Eurosmart Cosmo mitigeur lavabo c.lisse​","Eurosmart"]
[32824000,"Eurosmart Cosmo mitigeur lavabo c.lisse","Eurosmart"]
[32830001,"Mitigeur monocommande Lavabo Taille L Eurosmart Cosmopolitan Chromé","Eurosmart Cosmopolitan"]
[32833000,"Mitigeur monocommande Bain / Douche Eurosmart Cosmopolitan Chromé","Eurosmart Cosmopolitan"]
[32836000,"Mitigeur monocommande Bain / Douche Eurosmart Cosmopolitan Chromé","Eurosmart Cosmopolitan"]
[32838000,"Mitigeur monocommande Douche Eurosmart Cosmopolitan Chromé","Eurosmart Cosmopolitan"]
[32839000,"Mitigeur monocommande Bidet Taille S Eurosmart Cosmopolitan Chromé","Eurosmart Cosmopolitan"]
[32844000,"Mitigeur monocommande Evier Eurosmart Cosmopolitan Chromé","Eurosmart Cosmopolitan"]
[32845002,"Mitigeur monocommande Evier Eurosmart Cosmopolitan Chromé","Eurosmart Cosmopolitan"]
[32926002,"Mitigeur monocommande Lavabo Taille S Eurosmart Chromé","Eurosmart 2015"]
[32926003,"Mitigeur monocommande Lavabo Taille S Eurosmart Chromé","Eurosmart 2021"]
[32928002,"Mitigeur monocommande Bidet Taille S Eurosmart Chromé","Eurosmart 2015"]
[32928003,"Mitigeur monocommande Bidet Taille S Eurosmart Chromé","Eurosmart 2021"]
[33265002,"Mitigeur monocommande Lavabo Taille S Eurosmart Chromé","Eurosmart 2015"]
[33265003,"Mitigeur monocommande Lavabo Taille S Eurosmart Chromé","Eurosmart 2021"]
[33303002,"Mitigeur monocommande Bain / Douche Eurosmart Chromé","Eurosmart 2015"]
[33303003,"Mitigeur monocommande Bain / Douche Eurosmart Chromé","Eurosmart 2021"]
[33304002,"Mitigeur monocommande Bain / Douche Eurosmart Chromé","Eurosmart 2015"]
[33304003,"Mitigeur monocommande Bain / Douche Eurosmart Chromé","Eurosmart 2021"]
[33412002,"Mitigeur monocommande Bain / Douche Eurosmart Chromé","Eurosmart 2015"]
[33412003,"Mitigeur monocommande Bain / Douche Eurosmart Chromé","Eurosmart 2021"]
[34562000,"Mitigeur thermostatique Douche Grohtherm 800 Chromé","Grohtherm 800"]
[34565001,"Mitigeur thermostatique douche 1/2\" avec ensemble de douche Grohtherm 800 Chromé","Grohtherm 800"]
[34568000,"Mitigeur thermostatique de bain/douche 1/2\" Grohtherm 800 Chromé","Grohtherm 800"]
[34569000,"Mitigeur thermostatique Bain / Douche 1/2 Grohtherm 800 Chromé","Grohtherm 800"]
[34767000,"Mitigeur thermostatique Douche Grohtherm 800 Cosmopolitan Chromé","Grohtherm 800 Cosmopolitan"]
[34768000,"Ensemble de douche thermostatique Grohtherm 800 Cosmopolitan Chromé","Grohtherm 800 Cosmopolitan"]
[34770000,"Mitigeur thermostatique Bain / Douche 1/2 Grohtherm 800 Cosmopolitan Chromé","Grohtherm 800 Cosmopolitan"]
[34771000,"Mitigeur thermostatique Douche Grohtherm 800 Cosmopolitan Chromé","Grohtherm 800 Cosmopolitan"]
[34772000,"Mitigeur thermostatique Bain / Douche 1/2 Grohtherm 800 Cosmopolitan Chromé","Grohtherm 800 Cosmopolitan"]
["2337600E","Mitigeur monocommande Lavabo Taille S Eurosmart Cosmopolitan Chromé","Eurosmart Cosmopolitan"]
["2337700E","Mitigeur monocommande Lavabo Taille S Eurosmart Cosmopolitan Chromé","Eurosmart Cosmopolitan"]
["2339310E","Mitigeur monocommande Lavabo Taille M Eurosmart Chromé","Eurosmart 2015"]
["2339330E","Mitigeur monocommande Lavabo Taille M Eurosmart Chromé","Eurosmart 2021"]
["2339600E","Mitigeur monocommande Lavabo Taille M Eurosmart Cosmopolitan Chromé","Eurosmart Cosmopolitan"]
["2339800E","Mitigeur monocommande Lavabo Taille M Eurosmart Cosmopolitan Chromé","Eurosmart Cosmopolitan"]
["30193DC0","Mitigeur monocommande Evier Eurosmart Cosmopolitan Supersteel","Eurosmart Cosmopolitan"]
["30305DC1","Eurosmart 2021 mitig. év. douch ext bec bas","Eurosmart 2021"]
["3282500E","Mitigeur monocommande Lavabo Taille S Eurosmart Cosmopolitan Chromé","Eurosmart Cosmopolitan"]
["32843DC2","Mitigeur monocommande Evier Eurosmart Cosmopolitan Supersteel","Eurosmart Cosmopolitan"]
["33281DC3","Mitigeur Evier Eurosmart 2021","Eurosmart 2021"]

{"sheet":"Liste Pdts éligibles OLD","index":2,"n_rows":105,"n_cols":4,"rows_kept":105,"cut":false,"hidden":true,"merged":[[1,1,12,1],[71,1,104,1],[13,1,41,1],[42,1,61,1],[62,1,66,1],[67,1,70,1]]}
["Référence","Gamme","Poste d'eau","Désignation"]
[23762000,"Bauloop","Lav","BauLoop mitigeur lavabo M"]
[23763000,null,"Lav","BauLoop mitigeur lavabo L"]
[23340000,null,"Dche","BauLoop mitigeur douche mural"]
[23341000,null,"Bain Dche","BauLoop mitigeur B/D mural"]
[31368001,null,"Cuisine","BauLoop Mitigeur évier bec C"]
[31706000,null,"Cuisine","BauLoop mitigeur évier bec med EU"]
[22054001,null,"Lav","BauLoop  mitigeur lavabo S CH3"]
[23633001,null,"Dche","BauLoop mitigeur douche mural"]
[23602001,null,"Bain Dche","BauLoop mitigeur B/D mural"]
[23887001,null,"Lav","BauLoop mitigeur lavabo M CH3"]
[23763001,null,"Lav","BauLoop mitigeur lavabo L"]
[23335000,null,"Lav","Bauloop mitigeur lavabo S"]
[33265002,"Eurosmart","Lav","Eurosmart 2015 mitigeur lavabo S-Size"]
[32926002,null,"Lav","Eurosmart 2015 mitigeur lavabo"]
[23322001,null,"Lav","Eurosmart 2015 mitigeur lavabo M-Size"]
[23324001,null,"Lav","Eurosmart 2015 mitigeur lavabo c.lisse M"]
["2339310E",null,"Lav","Eurosmart 2015 mitigeur lavabo M"]
[23537002,null,"Lav","Eurosmart 2015 mitigeur lavabo L-Size"]
[32928002,null,"Bidet","Eurosmart 2015 mitigeur bidet F"]
[32172002,null,"Dche","Eurosmart 2015 mitigeur douche mural F"]
[33412002,null,"Bain Dche","Eurosmart 2015 mitigeur B/D Monotrou F"]
[32158002,null,"Bain Dche","Eurosmart 2015 mitigeur B/D mural F"]
[33304002,null,"Bain Dche","Eurosmart 2015 mitigeur B/D mural F"]
[33303002,null,"Bain Dche","Eurosmart 2015 mitig. B/D 2-tr. colonn.F"]
[30355000,null,"Cuisine","Eurosmart 2015 évier douch.dual bec bas"]
["33281DC2",null,"Cuisine","Eurosmart 2015 mitigeur évier"]
["33202DC2",null,"Cuisine","Eurosmart 2015 mitigeur évier"]
[30355000,null,"Cuisine","Eurosmart 2015 évier douch.dual bec bas"]
["33281DC2",null,"Cuisine","Eurosmart 2015 mitigeur évier"]
["33202DC2",null,"Cuisine","Eurosmart 2015 mitigeur évier"]
[32221002,null,"Cuisine","Eurosmart 2015 mitigeur évier bec bas"]
[32223002,null,"Cuisine","Eurosmart 2015 mitigeur évier bec haut"]
[32224002,null,"Cuisine","Eurosmart 2015 mitigeur évier mural"]
["30305DC0",null,"Cuisine","Eurosmart 2015 mitigeur évier bec bas"]
[30199000,null,"Cuisine","Eurosmart Cosmo évier bec orientable C3"]
["30305DC1",null,"Cuisine","Eurosmart 2021 mitig. év. douch ext bec bas"]
[30355001,null,"Cuisine","Eurosmart 2021 mitig. év. douch ext bec bas F"]
[32221003,null,"Cuisine","Eurosmart 2021 mitigeur évier bec bas F"]
[32223003,null,"Cuisine","Eurosmart 2021 mitigeur évier C bec haut F"]
[32224003,null,"Cuisine","Eurosmart 2021 mitigeur évier mural bec bas"]
["33281DC3",null,"Cuisine","Eurosmart 2021 mitigeur évier bec bas"]
["3282500E","Eurosmart Cosmo","Lav","Eurosmart Cosmo mit. lavabo Ecojoy 5L"]
[32824000,null,"Lav","Eurosmart Cosmo mitigeur lavabo c.lisse"]
["2337700E",null,"Lav","Eurosmart Cosmo lavabo S CH3 5L"]
["2337600E",null,"Lav","Eurosmart Cosmo lavabo c.lisse CH3 5L"]
[23325000,null,"Lav","Eurosmart Cosmo lavabo bec médium 5L"]
[23327000,null,"Lav","Eurosmart Cosmo lavabo médium c.lisse"]
["2339600E",null,"Lav","Eurosmart Cosmo lavabo Medium CH3 5L"]
["2339800E",null,"Lav","Eurosmart Cosmo lavabo M c.lisse CH3 5L"]
[32830001,null,"Lav","Eurosmart Cosmopolitan OHM taille L"]
[23921000,null,"Lav","Eurosmart Cosmop. mitig.cuvette c.lisse"]
[32839000,null,"Bidet","Eurosmart Cosmo mitigeur bidet"]
[32838000,null,"Dche","Eurosmart Cosmo mitigeur douche"]
[32836000,null,"Bain Dche","Eurosmart Cosmo B/D monotrou"]
[32833000,null,"Bain Dche","Eurosmart Cosmo mit. B/D avec raccords"]
[30199000,null,"Cuisine","Eurosmart Cosmo évier bec orientable C3"]
[32844000,null,"Cuisine","Eurosmart Cosmo évier bec bas C3"]
["30193DC0",null,"Cuisine","Eurosmart Cosmopolitan mitig. év. b.méd."]
[32845002,null,"Cuisine","Eurosmart Cosmopolitan OHM sink low sp F"]
["32843DC2",null,"Cuisine","Eurosmart Cosmopolitan mitig. év. C-bec"]
[31481001,null,"Cuisine","Eurosmart Cosmop. évier C-bec douch.dual"]
[34771000,"G800 Cosmo","Dche","GRT 800 Cosmopolitan THM douche mural F"]
[34767000,null,"Dche","GRT 800 Cosmop THM douche mur ss/racc"]
[34772000,null,"Bain Dche","GRT 800 Cosmopolitan THM B/D mural F"]
[34770000,null,"Bain Dche","GRT 800 Cosmopolitan THM B/D mur ss/racc"]
[34768000,null,"Dche","GRT 800 Cosmop THM douche mur +douche"]
[34562000,"G800","Dche","GRT 800 THM douche mural 1/2\" F"]
[34569000,null,"Bain Dche","GRT 800 THM B/D mural 1/2\" F"]
[34568000,null,"Bain Dche","GRT 800 THM B/D mural ss/racc."]
[34565001,null,"Dche","GRT 800 THM douche mural +ens.douche"]
[23328000,"Bauedge","Lav","BauEdge mitigeur lavabo"]
[23330000,null,"Lav","BauEdge mitigeur lavabo corps lisse"]
[23331000,null,"Bidet","BauEdge mitigeur bidet"]
[23333000,null,"Dche","BauEdge mitigeur douche mural"]
[23334000,null,"Bain Dche","BauEdge mitigeur B/D mural"]
[23356000,null,"Lav","BauEdge mitigeur lavabo F"]
[23559000,null,"Lav","BauEdge mitigeur lavabo F"]
[23560000,null,"Dche","BauEdge mitigeur douche mural F"]
[23561000,null,"Bain Dche","BauEdge mitigeur B/D mural F"]
[23562000,null,"Bain Dche","BauEdge mitigeur B/D Monotrou F"]
[23563000,null,"Cuisine","BauEdge mitigeur évier F"]
[23759000,null,"Lav","BauEdge mitigeur lavabo M"]
[23760000,null,"Lav","BauEdge mitigeur lavabo L"]
[23802000,null,"Lav","BauEdge mitigeur lavabo S"]
[23822000,null,"Lav","BauEdge mitigeur lavabo M"]
[29078000,null,"Dche","BauEdge set mitigeur douche"]
[31367000,null,"Cuisine","BauEdge mitigeur évier bec orientable"]
[31590000,null,"Cuisine","BauEdge mitigeur évier C-bec F"]
[31682000,null,"Cuisine","BauEdge mitigeur évier bec bas F"]
[31694000,null,"Cuisine","BauEdge mitigeur évier bec med F"]
[32819000,null,"Lav","BauEdge mitigeur lavabo"]
[32822000,null,"Bidet","BauEdge mitigeur bidet"]
[31367001,null,"Cuisine","BauEdge mitigeur évier bec orientable"]
[31590000,null,"Cuisine","BauEdge mitigeur évier C-bec F"]
[31694000,null,"Cuisine","BauEdge mitigeur évier bec med F"]
[31682000,null,"Cuisine","BauEdge mitigeur évier bec bas F"]
[23330001,null,"Lav","BauEdge mitigeur lavabo c.lisse S"]
[23559001,null,"Lav","BauEdge mitigeur lavabo S CH3"]
[23913001,null,"Dche","BauEdge mitigeur douche mural C2"]
[23914001,null,"Bain Dche","BauEdge mitigeur B/D mural C2"]
[23562001,null,"Bain Dche","BauEdge mitigeur B/D Monotrou C2"]
[23759001,null,"Lav","BauEdge mitigeur lavabo M CH3"]
[23328001,null,"Lav","BauEdge mitigeur lavabo S"]
[23758001,null,"Lav","BauEdge mitigeur lavabo M"]

{"sheet":"Défaut","index":3,"n_rows":20,"n_cols":1,"rows_kept":20,"cut":false,"hidden":true,"merged":[]}
["Défaut"]
["Défaut de surface"]
["Cassure/Fissure"]
["Ecoulement réduit"]
["Commande inopérante"]
["Grippage/Dureté de manœuvre"]
["Fuite"]
["Corrosion"]
["Bruit anormal"]
["Immontable"]
["Livraison de pièce erronée"]
["Défaut de réglage"]
["Jeu anormal non réparable"]
["frottement dû à défaut de jeu fonctionnel"]
["Ecoulement continu"]
["Problématique incertaine"]
["Altération de la finition "]
["Défaut sur filetage/taraudage"]
["Déviation/s dimensionnelle/s"]
["Défaut d'emballage"]

{"sheet":"Loc défaut","index":4,"n_rows":25,"n_cols":1,"rows_kept":25,"cut":false,"hidden":true,"merged":[]}
["Localisation Défaut"]
["Corps"]
["Bec / Sortie"]
["Joints"]
["Flexibles ou tubes d'alimentation / Entrées"]
["Panneau de contrôle / Boitier de contrôle sans fil"]
["Mousseur"]
["Set de fixation"]
["Aquadimmer"]
["Filtre(s)"]
["Tête d'arrêt"]
["Inverseur"]
["Poignée / Levier / Bouton de commande"]
["Vidage"]
["Tirette de vidage / graine d'attache"]
["Siège"]
["Rosace de finition"]
["Vanne(s) d'arrêt"]
["Element thermostatique"]
["Cartouche à disques céramique"]
["Raccord rapide"]
["Douchette(s) à main / Douche(s) de tête"]
["Flexible de douche / flexible extractible"]
["Eléments de fixation"]
["Marquage / Logo"]